{"text_format":"1","workbook":"xlsx","n_sheets":12,"sheets":["Main","Pack","InvrtChgrs","Converters","Alternators","SOC vs OCV","VOLTA_29Ah_SOCvsOCV 30degC","Volta NMC Cells","Inverters","SOCvsOCV 10degC","SOCvsOCV 30degC","OCV Table"],"not_rendered":{"charts":4,"images":4,"macros":1,"external_links":0,"defined_names":11,"comments":2,"pivot_tables":0},"unopened":[],"bounds":{"document_bytes":16777216,"sheet_cells":100000,"rows_first":2000,"rows_last":500,"rows_between":2000,"halvings":0,"cell_chars":16384,"cell_head_chars":4096},"cells_cut":0,"cells_raw":0,"read":"whole","date_system":"1900"}

{"sheet":"Main","index":0,"n_rows":84,"n_cols":19,"rows_kept":84,"cut":false,"hidden":false,"merged":[[26,14,27,15],[26,13,27,13],[26,12,27,12],[28,14,28,15],[45,14,46,15],[47,14,47,15],[48,14,48,15],[45,8,46,9],[47,8,47,9],[48,8,48,9],[29,9,30,9],[82,2,82,3],[83,2,83,3],[58,12,58,13],[59,12,59,13],[60,12,60,13],[61,12,61,13],[62,12,62,13],[63,12,63,13],[64,12,64,13],[65,12,65,13],[66,12,66,13],[67,12,67,13],[68,12,68,13],[69,12,69,13],[72,7,72,8],[73,7,73,8],[77,2,77,3],[78,2,78,3],[79,2,79,3],[80,2,80,3],[81,2,81,3],[72,2,72,3],[73,2,73,3],[74,2,74,3],[75,2,75,3],[76,2,76,3],[1,8,4,12],[32,7,33,8],[32,9,33,9],[32,10,33,10],[32,11,33,13],[52,2,52,3],[53,2,53,3],[54,2,54,3],[55,2,55,3],[25,10,25,11],[25,5,25,6],[45,10,46,11],[47,10,47,11],[48,10,48,11],[45,12,46,13],[47,12,47,13],[48,12,48,13],[8,1,8,2],[12,1,12,2],[16,1,16,2],[20,1,20,2],[9,1,9,2],[13,1,13,2],[17,1,17,2],[21,1,21,2],[29,1,30,1],[29,2,30,2],[25,3,25,4],[24,3,24,4],[28,3,28,4],[29,3,30,4],[58,2,58,3],[58,7,58,8],[59,7,59,8],[59,2,59,3],[32,1,32,2],[64,2,64,3],[28,5,28,6],[27,5,27,6],[28,7,28,8],[29,7,30,8],[47,2,47,3],[48,2,48,3],[46,1,46,3],[45,1,45,3],[33,1,34,2],[35,1,35,2],[32,3,32,4],[33,3,34,4],[35,3,35,4],[60,7,60,8],[60,2,60,3],[18,11,18,12],[51,1,51,2],[26,3,27,4],[26,2,27,2],[26,1,27,1],[39,2,39,3],[40,2,40,3],[41,2,41,3],[42,2,42,3],[43,2,43,3],[39,4,39,5],[40,4,40,5],[41,4,41,5],[29,10,30,11],[6,5,6,6],[10,5,10,6],[14,5,14,6],[14,11,14,12],[16,11,16,12],[14,7,14,8],[14,9,14,10],[5,1,5,2],[45,4,46,4],[45,5,46,5],[45,6,46,6],[45,7,46,7],[7,3,8,3],[7,7,8,7],[7,8,8,8],[6,7,6,8],[6,9,6,10],[7,9,8,9],[7,10,8,10],[10,7,10,8],[10,9,10,10],[38,1,38,2],[10,11,10,12],[11,11,12,11],[11,12,12,12],[6,11,6,12],[7,11,8,11],[7,12,8,12],[42,4,42,5],[43,4,43,5],[11,3,12,3],[11,7,12,7],[11,8,12,8],[11,9,12,9],[11,10,12,10],[15,3,16,3],[15,7,16,7],[15,8,16,8],[15,9,16,9],[15,10,16,10],[18,7,18,8],[18,9,18,10],[19,3,20,3],[19,7,20,7],[19,8,20,8],[19,9,20,9],[19,10,20,10],[18,5,18,6],[74,12,74,13],[73,12,73,13],[72,12,72,13],[78,7,78,8],[77,7,77,8],[76,7,76,8],[75,7,75,8],[74,7,74,8],[83,7,83,8],[82,7,82,8],[81,7,81,8],[80,7,80,8],[79,7,79,8],[75,12,75,13],[76,12,76,13],[77,12,77,13],[78,12,78,13],[79,12,79,13],[80,12,80,13],[81,12,81,13],[82,12,82,13],[83,12,83,13],[70,10,70,11],[68,7,68,8],[68,2,68,3],[70,2,70,3],[70,13,70,14],[63,2,63,3],[62,2,62,3],[61,2,61,3],[70,7,70,8],[69,7,69,8],[67,7,67,8],[66,7,66,8],[65,7,65,8],[64,7,64,8],[63,7,63,8],[62,7,62,8],[61,7,61,8],[65,2,65,3],[66,2,66,3],[67,2,67,3],[69,2,69,3]]}
[]
[null,null,null,null,null,null,null,null,"Volta 2.1 Configuration Manager"]
[]
[]
[]
[null,"Pack(s) Information"]
[null,null,null,"Number of \nModules:",null,"Total Output / Input Current in Pack # 1 (A)",null,"Total Whr's \nof Energy in Pack # 1",null,"Total Useable Energy in Pack # 1",null,"Total Energy in System (Whr)"]
[null,"Battery Number # 1 Size:",null,6,null,{"$f":"\"Output \" & D8*Pack!$B$34","v":"Output 522"},"A",{"$f":"D8*Pack!B22","v":20218.800000000003},"Whr's",{"$f":"D8*Pack!B25","v":18196.920000000002},"Whr's",{"$f":"SUM(H8+H12+H16+H20)","v":20218.800000000003},"Whr"]
[null,"Heating Options",null,null,null,{"$f":"\"Input \" &D8*Pack!$B$49","v":"Input 261"},"A"]
[null,"None",null,null,null,{"$f":"IF(D8*Pack!$B$34>Pack!B$52,\"Fuse Limited\",\"\")","v":"Fuse Limited"},{"$f":"IF(F10=\"Fuse Limited\",\"@ \"&Pack!$B$52 & \"A\",\"\")","v":"@ 350A"}]
[null,null,null,"Number of \nModules:",null,"Total Output / Input Current in Pack # 2 (A)",null,"Total Whr's \nof Energy in Pack # 2",null,"Total Useable Energy in Pack # 2",null,"Total Usable Energy in System (Whr)"]
[null,"Battery Number # 2 Size:",null,0,null,{"$f":"\"Output \" & D12*Pack!$B$34","v":"Output 0"},"A",{"$f":"D12*Pack!B22","v":0},"Whr's",{"$f":"D12*Pack!B25","v":0},"Whr's",{"$f":"SUM(J8+J12+J16+J20)","v":18196.920000000002},"Whr"]
[null,"Heating Options",null,null,null,{"$f":"\"Input \" &D12*Pack!$B$49","v":"Input 0"},"A"]
[null,"None",null,null,null,{"$f":"IF(D12*Pack!$B$34>Pack!B$52,\"Fuse Limited\",\"\")","v":""},{"$f":"IF(F14=\"Fuse Limited\",\"@ \"&Pack!$B$52 & \"A\",\"\")","v":""}]
[null,null,null,"Number of \nModules:",null,"Total Output / Input Current in Pack # 3 (A)",null,"Total Whr's \nof Energy in Pack # 3",null,"Total Useable Energy in Pack # 3",null,"Total Discharge capability of System (A)"]
[null,"Battery Number # 3 Size:",null,0,null,{"$f":"\"Output \" & D16*Pack!$B$34","v":"Output 0"},"A",{"$f":"D16*Pack!B22","v":0},"Whr's",{"$f":"D16*Pack!B25","v":0},"Whr's",{"$f":"IF(SUM($D$8,$D$12,$D$16,$D$20)*Pack!$B$34>(SUM(COUNTIF(D8:D21,\">\"&0))*Pack!$B$52),(SUM(COUNTIF(D8:D21,\">\"&0))*Pack!$B$52),SUM($D$8,$D$12,$D$16,$D$20)*Pack!$B$34)","v":350},"A"]
[null,"Heating Options",null,null,null,{"$f":"\"Input \" &D16*Pack!$B$49","v":"Input 0"},"A",null,null,null,null,{"$f":"IF(SUM($D$8,$D$12,$D$16,$D$20)*Pack!$B$34>(SUM(COUNTIF(D8:D21,\">\"&0))*Pack!$B$52),\"Pack is now Fuse Limited\",\"\")","v":"Pack is now Fuse Limited"}]
[null,"None",null,null,null,{"$f":"IF(D16*Pack!$B$34>Pack!B$52,\"Fuse Limited\",\"\")","v":""},{"$f":"IF(F18=\"Fuse Limited\",\"@ \"&Pack!$B$52 & \"A\",\"\")","v":""}]
[null,null,null,"Number of \nModules:",null,"Total Output / Input Current in Pack # 4 (A)",null,"Total Whr's \nof Energy in Pack # 4",null,"Total Useable Energy in Pack # 4",null,"Total Charging capability of System (A)"]
[null,"Battery Number # 4 Size:",null,0,null,{"$f":"\"Output \" & D20*Pack!$B$34","v":"Output 0"},"A",{"$f":"D20*Pack!B22","v":0},"Whr's",{"$f":"D20*Pack!B25","v":0},"Whr's",{"$f":"SUM($D$8,$D$12,$D$16,$D$20)*Pack!$B$49","v":261},"A"]
{"$rows_left_out":65}
{"sheet":"Pack","index":1,"n_rows":119,"n_cols":17,"rows_kept":119,"cut":false,"hidden":true,"merged":[[80,1,80,4]]}
[null,null,null,null,null,null,null,null,null,null,null,null,null,null,null,null,"Inverter / Chargers"]
[null,"Volta Pack Capabilities",null,null,null,null,null,null,null,null,null,"Volta Pack",null,null,null,null,"None"]
[null,null,null,null,null,null,null,null,null,null,null,"Volta Junction Box",null,null,null,null,"Sensata 51NP36HRQ-099"]
[null,"Valid Pack Voltage Range1",null,null,null,null,null,null,null,null,null,null,null,null,null,null,"Sensata 51NP27"]
[null,"Min. Pack V","Max. Pack V"]
[null,{"$f":"ROUND(MIN('SOC vs OCV'!H6:H26),2) & \" V\"","v":"45.39 V"},{"$f":"ROUND(MAX('SOC vs OCV'!H6:H26),2) & \" V\"","v":"58.6 V"}]
[]
[null,"Normal Operation Voltage Range2",null,null,null,null,null,null,null,null,null,null,null,null,null,null,"Alternators"]
[null,"Min. Pack V","Max. Pack V",null,null,null,null,null,null,"Volta Junction Box Capabilities",null,null,null,null,null,null,"None"]
[null,{"$f":"ROUND(MIN('SOC vs OCV'!H6:H24),2) & \" V\"","v":"48.83 V"},{"$f":"ROUND(MAX('SOC vs OCV'!H6:H24),2) & \" V\"","v":"58.6 V"},null,null,null,null,null,null,"Weight","xx","lbs",null,null,null,null,"55i-190ext-56J"]
[null,null,null,null,null,null,null,null,null,"Volta Junction Box Contactor Rating Continuous (A)",null,null,null,null,null,null,"160HP-RAM64-58"]
[null,"Nominal Battery Voltage",null,null,null,null,null,null,null,{"$f":"600","v":600},"A"]
[null,{"$f":"51 & \" V\"","v":"51 V"}]
[null,null,null,null,null,null,null,null,null,"Service Disconnect Switch Continuous Rating (A)"]
[null,"Nominal Module Capacity @ 300C",null,null,null,null,null,null,null,400,"A",null,null,null,null,null,"Converters"]
[null,"58 Ah",null,null,null,null,null,null,null,null,null,null,null,null,null,null,"None"]
[null,null,null,null,null,null,null,null,null,null,null,null,null,null,null,null,"Sensata 51DC12-125"]
[null,"Operational Module Capacity (1C) @ 300C3",null,null,null,null,null,null,null,null,null,null,null,null,null,null,"Sensata 51DC24-110"]
[null,{"$f":"ROUND(2*'VOLTA_29Ah_SOCvsOCV 30degC'!C5,2) & \" Ah\"","v":"54.22 Ah"}]
[]
{"$rows_left_out":100}
{"sheet":"InvrtChgrs","index":2,"n_rows":5,"n_cols":25,"rows_kept":5,"cut":false,"hidden":true,"merged":[[1,7,1,8],[1,9,1,10],[1,14,1,15]]}
[null,"Inverter",null,null,null,null,null,null,null,null,null,null,null,null,"Battery Charger",null,null,null,null,null,null,"Bypass Circuit","Input Transient Clamping Circuit"]
[null,"Output Power \nCont. (W)","Output Peak Power (W)","Output Current (Amps AC Cont)","Output AC Voltage\n(VAC)","Peak DC Input Current \n(Amps DC)","Max. Normal DC Input Current (Amps DC)","Input DC Voltage Range (V)",null,"Operating Temperature Range",null,"Dimensions","Weight (lbs)","Inverter Efficiency","AC Input Voltage Range (VAC)",null,"Max. AC Input Current \n(Amps AC)","Output Current (Amps DC)","Output Voltage (Voltage DC)","Charger Enable On (% SOC)","Charger Enable Off (% SOC)","Bypass Relay Capability (Amps AC)","Input Transient Clamping Capabilities (Joules)","Overvoltage Trip Point (V)","Front End Bus Capacitance (F)"]
["Sensata 51NP36HRQ-099",3600,6000,30,120,91,77,44.3,60,"-200C","650C","13.8\" x 17.1\" x 8\"",68,0.91,95,135,30,50,58.2,92,96,30,2100,65,"14,400uF"]
[null,null,null,null,null,null,null,"Min.","Max.","Min.","Max.",null,null,null,"min.","max.",null,null,null,"Software Cal","Software Cal"]
["None"]

{"sheet":"Converters","index":3,"n_rows":7,"n_cols":17,"rows_kept":7,"cut":false,"hidden":true,"merged":[[1,7,1,8],[1,9,1,10]]}
[null,"Converters"]
[null,"Output Current (Amps DC Cont)","Typical Output Voltage (± 0.1 V) (Vdc)","Input DC Current Nom. (Adc)","Peak Output Current (Adc)","Weight (lbs)","Dimensions","Input Voltage Range DC (Vdc)",null,"Output Voltage Range DC (Vdc)",null,"DC Surge Voltage (Vdc)","Efficiency (%)","Input Transient Clamping (J)","Over-Voltage Trip Point (V)","Front End Capacitance (F)","Note:"]
["Sensata 51DC12-125",125,14.4,46,215,42,"13.4\" x 14.5\" x 5.7\"",44.3,58,12.6,14.4,63,0.9,2100,65,"14,400uF","NP Cube"]
[null,null,null,null,null,null,null,"Min.","Max.","Min.","Max.",null,"@ 50% Load"]
["None"]
["Sensata 51DC24-110",110,28.8,90,200,68,"13.8\" x 17.1\" x 8.0\"",44.3,58,25.2,28.8,null,0.91,2100,65,"14,400uF","NP Large"]
[null,null,null,null,null,null,null,"Min.","Max.","Min.","Max.",null,"@ 40% Load"]

{"sheet":"Alternators","index":4,"n_rows":6,"n_cols":8,"rows_kept":6,"cut":false,"hidden":true,"merged":[]}
[null,"Alternators"]
[]
[null,"Weight (lbs)","Max. Voltage Output (Vdc)","Max. Amperage Output (Adc)","Turn On speed @ shaft (rpm)","Horsepower Required @ 191A \n(HP)","Alternator Inhibit Enable \n(pack software calibration)\n(% SOC)","Alternator Inhibit Exit (pack software calibration)\n(% SOC)"]
["55i-190ext-56J",35,58,191,2732,19.760000000000002,0.95,0.89]
["160HP-RAM64-58",null,58,50,3700,null,0.95,0.89]
["None"]

{"sheet":"SOC vs OCV","index":5,"n_rows":115,"n_cols":18,"rows_kept":115,"cut":false,"hidden":true,"merged":[[3,0,3,4]]}
[]
[]
[]
["30°C",null,null,null,null,null,null,null,null,null,null,"Pack Level OCV"]
["Discharge \nCapacity (Ah)","SOC (%)","OCV (V) ","SOC (%)\nInterpolated","OCV (V)\nInterpolated",null,"SOC (%)","Pack OCV (V)",null,null,"SOC (%)","SOC (%)","Cell OCV (V)\nInterpolated","Cell OCV (V)\nInterpolated","Pack OCV (V)\nInterpolated","Pack OCV (V)\nInterpolated"]
[0,100,4.1860999999999997,100,4.1859999999999999,null,100,{"$f":"E6*14","v":58.603999999999999},null,null,{"$f":"100","v":100},1.05,null,null,null,{"$f":"58.8&\"V\"","v":"58.8V"}]
[1.25,94.791666666666657,4.1184000000000003,95,{"$f":"C7+(C6-C7)*((D7-B7)/(B6-B7))","v":4.1211080000000004},null,95,{"$f":"E7*14","v":57.695512000000008},null,null,99,{"$f":"K6 & \"%\"","v":"100%"},{"$f":"C6","v":4.1860999999999997},{"$f":"ROUND(M7,3)&\"V\"","v":"4.186V"},{"$f":"M7*14","v":58.605399999999996},{"$f":"ROUND(O7,2)&\"V\"","v":"58.61V"}]
[2.5,89.583333333333343,4.0553999999999997,90,4.0604399999999998,null,90,56.846159999999998,null,null,98,"99%",{"$f":"$C$7+($C$6-$C$7)*((K7-$B$7)/($B$6-$B$7))","v":4.1731015999999999},{"$f":"ROUND(M8,3)&\"V\"","v":"4.173V"},58.4234224,{"$f":"ROUND(O8,2)&\"V\"","v":"58.42V"}]
[3.75,84.375,3.996,85,4.0031280000000002,null,85,56.043792000000003,null,null,97,"98%",{"$f":"$C$7+($C$6-$C$7)*((K8-$B$7)/($B$6-$B$7))","v":4.1601032},"4.16V",58.241444799999996,"58.24V","→","Auto Shut-Down Generator @ ~ ≥ 58.24V"]
[5,79.166666666666657,3.9394999999999998,80,3.9485399999999999,null,80,55.279559999999996,null,null,96,"97%",{"$f":"$C$7+($C$6-$C$7)*((K9-$B$7)/($B$6-$B$7))","v":4.1471048000000001},"4.147V",58.0594672,"58.06V","→","Alternator(s) maximum Voltage output @ ~ 58.0V"]
[6.25,73.958333333333329,3.8866000000000001,75,3.8971800000000001,null,75,54.560520000000004,null,null,95,"96%",{"$f":"$C$7+($C$6-$C$7)*((K10-$B$7)/($B$6-$B$7))","v":4.1341064000000003},"4.134V",57.877489600000004,"57.88V","→","Disable Chargers @ ~ 96%"]
[7.5,68.75,3.8327,70,3.8456359999999998,null,70,53.838903999999999,null,null,94,"95%",{"$f":"$C$7+($C$6-$C$7)*((K11-$B$7)/($B$6-$B$7))","v":4.1211080000000004},"4.121V",57.695512000000008,"57.7V"]
[8.75,63.541666666666671,3.7772999999999999,65,3.7928120000000001,null,65,53.099367999999998,null,null,93,"94%",{"$f":"$C$8+($C$7-$C$8)*(($K12-$B$8)/($B$8-$B$9))","v":4.1088240000000003},"4.109V",57.523536000000007,"57.52V","→","*(1) Prevent Alternator #1 Charging @ ~ 95.5%"]
[10,58.333333333333329,3.7322000000000002,60,3.746632,null,60,52.452848000000003,null,null,92,"93%",{"$f":"$C$8+($C$7-$C$8)*(($K13-$B$8)/($B$8-$B$9))","v":4.0967279999999997},"4.097V",57.354191999999998,"57.35V"]
[11.25,53.125,3.6991999999999998,55,3.7110799999999999,null,55,51.955120000000001,null,null,91,"92%",{"$f":"$C$8+($C$7-$C$8)*(($K14-$B$8)/($B$8-$B$9))","v":4.084632},"4.085V",57.184848000000002,"57.18V","→","Enable Chargers @ ~ 92%"]
[12.5,47.916666666666664,3.6741999999999999,50,3.6841999999999997,null,50,51.578799999999994,null,null,90,"91%",{"$f":"$C$8+($C$7-$C$8)*(($K15-$B$8)/($B$8-$B$9))","v":4.0725359999999995},"4.073V",57.015503999999993,"57.02V"]
[13.5,43.75,3.6545999999999998,45,3.6604799999999997,null,45,51.246719999999996,null,null,89,"90%",{"$f":"$C$8+($C$7-$C$8)*(($K16-$B$8)/($B$8-$B$9))","v":4.0604399999999998},"4.06V",56.846159999999998,"56.85V","→","Re-Enable Alternator #1 Charging @ ~ 90.5%"]
[14.75,38.541666666666664,3.6387,40,3.6431520000000002,null,40,51.004128000000001,null,null,88,"89%",{"$f":"$C$9+($C$8-$C$9)*(($K17-$B$9)/($B$9-$B$10))","v":4.0487471999999993},"4.049V",56.682460799999987,"56.68V","→","Prevent Alternator #2 Charging @ ~ ≥ 56.65V"]
[16,33.333333333333336,3.6221999999999999,35,3.6274799999999998,null,35,50.78472,null,null,87,"88%",{"$f":"$C$9+($C$8-$C$9)*(($K18-$B$9)/($B$9-$B$10))","v":4.0373424},"4.037V",56.5227936,"56.52V"]
[17.25,28.125,3.5943999999999998,30,3.6044079999999998,null,30,50.461711999999999,null,null,86,"87%",{"$f":"$C$9+($C$8-$C$9)*(($K19-$B$9)/($B$9-$B$10))","v":4.0259375999999998},"4.026V",56.363126399999999,"56.36V"]
{"$rows_left_out":96}
{"sheet":"VOLTA_29Ah_SOCvsOCV 30degC","index":6,"n_rows":55,"n_cols":5,"rows_kept":55,"cut":false,"hidden":true,"merged":[]}
[]
[]
[]
[null,"Usable SOC","Usable Dcap at 1C (Ah)","1hr OCV","1C"]
[null,0,27.108276844532327,3.4260000000000002,3.0093485507246367]
[null,0.02,26.56611130764168,3.4392617721231229,3.1855747044146123]
[null,0.04,26.023945770751034,3.4493747044174565,3.2652608653634791]
[null,0.06,25.481780233860388,3.4628610644437168,3.3089933886431329]
[null,0.08,24.939614696969741,3.4799935830847333,3.3398775802585439]
[null,0.1,24.397449160079095,3.4953160481988159,3.3644887854297645]
[null,0.12,23.855283623188448,3.5092746231929564,3.3850650427899178]
[null,0.14000000000000001,23.313118086297802,3.5225658446710852,3.4027356156866029]
[null,0.16,22.770952549407156,3.5343080239748232,3.4177309271402918]
[null,0.18,22.228787012516509,3.5449676464214117,3.4311339540408587]
[null,0.2,21.686621475625863,3.5556763430031335,3.4438399767214833]
[null,0.22,21.144455938735213,3.5666699001652025,3.4558971832244496]
[null,0.24,20.60229040184457,3.5775616212200854,3.4672876963075221]
[null,0.26,20.06012486495392,3.5881679018581858,3.4774635049105616]
[null,0.28000000000000003,19.517959328063274,3.598166033074607,3.4853472377787793]
[null,0.3,18.975793791172627,3.6052708805843974,3.4925200832781522]
{"$rows_left_out":36}
{"sheet":"Volta NMC Cells","index":7,"n_rows":27,"n_cols":9,"rows_kept":27,"cut":false,"hidden":true,"merged":[]}
[]
["Cell Specifications:",null,null,null,null,"Module Specs:",28,"Cells / Module"]
["Capacity (nom)",29,"Ah",null,null,"Nominal Energy Rating",{"$f":"G5*G8","v":2963.8},"Wh"]
["Capacity (min)",27.5,"Ah",null,null,"Maximum Energy Rating",{"$f":"G6*G8","v":3398.22},"Wh"]
["Cell Voltage (nom)",3.65,"V",null,null,"Nominal Voltage",{"$f":"B5*14","v":51.1},"V"]
["Cycle Life (>80%)",2000,"Cycles",null,null,"Maximum Voltage",{"$f":"B22*14","v":58.589999999999996},"V"]
["Operating Temp",-20,60,"0C",null,"Low Voltage",{"$f":"B23*14","v":44.800000000000004},"V"]
["Charging Temp",0,45,"0C",null,"Module Capacity (Nom)",{"$f":"B3*2","v":58},"Ah"]
["AC Impedance","≤1","mΩ",null,null,"Maximum Module Charge",58,"A","1C w/ 2 cell in Parallel up to 58.1V"]
["Energy Density",475,"Wh/L",null,null,"Constant Voltage Charge",58.1,58.8,"V"]
["Gravimetric Density",220,"Wh/kg"]
["Discharge V (min)",2,"V"]
["Discharge Max (cont)",100,"A"]
["Discharge peak",175,"A"]
["Charge Method","CC-CV"]
["Max Charge Current",29,"A"]
["Constant Voltage",4.1500000000000004,4.2,"V",null,"Total Modules per pack",5,"# of Modules"]
["Charge Termination",290,"mA",null,null,"Total Packs ",2]
[null,null,null,null,null,"Total Pack Wh",{"$f":"(G17*G4)*G18","v":33982.199999999997},"Wh"]
["Module Voltage High",58.8,"V",null,null,"Total Pack(s) Ah",{"$f":"((G9)*G17)*G18","v":580},"Ah"]
{"$rows_left_out":8}
{"sheet":"Inverters","index":8,"n_rows":56,"n_cols":13,"rows_kept":56,"cut":false,"hidden":true,"merged":[]}
["Sensata ",null,null,null,null,"Sensata ",null,null,null,null,"Sensata "]
["48NP36HRQ-099  AC/DC Inverter",null,null,null,null,"48DC12-150 DC/DC Converter with Integrated 48V Clamp",null,null,null,null,"48DC12-240 DC/DC Converter with Integrated 48V Clamp"]
[]
["Inverter:",null,null,null,null,"Converter:",null,null,null,null,"Converter:"]
["Output Power (W) AC continuous:",3600,null,null,null,"Output Power (W) DC continuous:",1800,"@250C",null,null,"Output Voltage (W) DC continuous:"]
["Output Current (A) AC continuous:",30,null,null,null,"Output Current (A) DC continuous:",150,null,null,null,"Output Current (A) DC continuous:",30]
["Input Voltage (V) DC Range:","39V - 50V","5 sec @ 39V",null,null,"Output Voltage (V) DC nom.:",12.6,null,null,null,"Output Voltage (V) DC nom.:",12.6]
["Surge Voltage (V) DC:","60V",null,null,null,"Output Voltage (V) DC max.:","14.4V",null,null,null,"Output Voltage (V) DC max.:",14.4]
["Input Current (A) DC continuous:",94,null,null,null,"Input Voltage (V) DC Range:","39V - 50V","5 sec @ 39V",null,null,"Voltage Surge Rating (V):","60V"]
["Peak Power (W) AC:",6000,null,"`",null,"Input Current (A) DC continuous:",50,null,null,null,"Input Voltage (V) DC Range:","39V - 50V","5 sec @ 39V"]
["Peak Output (A) AC:",100,null,null,null,null,null,null,null,null,"Input Current (A) DC continuous:",100]
["Weight (lbs):",68,null,null,null,"Surge Voltage (V):",60,null,null,null,"Idle current (typ) (A):",0.9]
["Output Voltage (VAC):",120,"±5%",null,null,"Peak Output (W) :",3100,null,null,null,"Continuous output Power (W):",3000]
["Output Frequency (Hz):",60,"±0.05%",null,null,"Weight (lbs):",42,null,null,null,"Weight (lbs):",63]
["Output Waveform:","Pure Sine < 5% THD",null,null,null,null,null,null,null,null,"Efficiency:",0.91,"@ 40%"]
["Operating Temperature:","-200C to 650C",null,null,null,null,null,null,null,null,"Efficiency:",0.84,"@100%"]
["Inverter Efficiency:",0.91,"@ 50%"]
[null,null,null,null,null,"Operating Temperature:","-200C to 650C",null,null,null,"Operating Temperature:","-200C to 650C"]
["Charger:",null,null,null,null,"Converter Efficiency:",0.9,"@50%",null,null,"Converter Efficiency:","~96%"]
["AC Input Voltage Range:","95VAC to 135VAC"]
{"$rows_left_out":37}
{"sheet":"SOCvsOCV 10degC","index":9,"n_rows":22,"n_cols":3,"rows_kept":22,"cut":false,"hidden":true,"merged":[[0,0,0,2]]}
["10°C"]
["Discharge Capacity (Ah)","OCV (V) ","SOC vs OCV (10degC)"]
[0,4.1859000000000002,{"$f":"(1-(A3/$A$22))*100","v":100}]
[1.25,4.117,{"$f":"(1-(A4/$A$22))*100","v":94.505494505494497}]
[2.5,4.0541999999999998,89.010989010989007]
[3.75,3.9946000000000002,83.516483516483518]
[5,3.9379,78.021978021978029]
[6.25,3.8832,72.527472527472526]
[7.5,3.8262999999999998,67.032967032967036]
[8.75,3.7725,61.53846153846154]
[10,3.7284999999999999,56.043956043956044]
[11.25,3.6949000000000001,50.549450549450547]
[12.5,3.6690999999999998,45.054945054945051]
[13.5,3.6495000000000002,40.659340659340657]
[14.75,3.6328,35.164835164835161]
[16,3.6166,29.670329670329664]
[17.25,3.5950000000000002,24.175824175824179]
[18.5,3.5684999999999998,18.681318681318682]
[19.75,3.5390000000000001,13.186813186813184]
[21,3.5038,7.6923076923076872]
{"$rows_left_out":3}
{"sheet":"SOCvsOCV 30degC","index":10,"n_rows":23,"n_cols":3,"rows_kept":23,"cut":false,"hidden":true,"merged":[[0,0,0,2]]}
["30°C"]
["Discharge Capacity (Ah)","OCV (V) ","SOC vs OCV (30degC)"]
[0,4.1860999999999997,{"$f":"(1-($A3/$A$23))*100","v":100}]
[1.25,4.1184000000000003,{"$f":"(1-($A4/$A$23))*100","v":94.791666666666657}]
[2.5,4.0553999999999997,89.583333333333343]
[3.75,3.996,84.375]
[5,3.9394999999999998,79.166666666666657]
[6.25,3.8866000000000001,73.958333333333329]
[7.5,3.8327,68.75]
[8.75,3.7772999999999999,63.541666666666671]
[10,3.7322000000000002,58.333333333333329]
[11.25,3.6991999999999998,53.125]
[12.5,3.6741999999999999,47.916666666666664]
[13.5,3.6545999999999998,43.75]
[14.75,3.6387,38.541666666666664]
[16,3.6221999999999999,33.333333333333336]
[17.25,3.5943999999999998,28.125]
[18.5,3.5672999999999999,22.916666666666664]
[19.75,3.5388000000000002,17.708333333333336]
[21,3.5038999999999998,12.5]
{"$rows_left_out":4}
{"sheet":"OCV Table","index":11,"n_rows":102,"n_cols":5,"rows_kept":102,"cut":false,"hidden":true,"merged":[]}
["SOC (%)","Cell OCV (V)\nInterpolated","Cell OCV (V)\nInterpolated","Pack OCV (V)\nInterpolated","Pack OCV (V)\nInterpolated"]
["100%",4.1860999999999997,"4.186V",58.605399999999996,"58.61V"]
["99%",4.1731015999999999,"4.173V",58.4234224,"58.42V"]
["98%",4.1601032,"4.16V",58.241444799999996,"58.24V"]
["97%",4.1471048000000001,"4.147V",58.0594672,"58.06V"]
["96%",4.1341064000000003,"4.134V",57.877489600000004,"57.88V"]
["95%",4.1211080000000004,"4.121V",57.695512000000008,"57.7V"]
["94%",4.1088240000000003,"4.109V",57.523536000000007,"57.52V"]
["93%",4.0967279999999997,"4.097V",57.354191999999998,"57.35V"]
["92%",4.084632,"4.085V",57.184848000000002,"57.18V"]
["91%",4.0725359999999995,"4.073V",57.015503999999993,"57.02V"]
["90%",4.0604399999999998,"4.06V",56.846159999999998,"56.85V"]
["89%",4.0487471999999993,"4.049V",56.682460799999987,"56.68V"]
["88%",4.0373424,"4.037V",56.5227936,"56.52V"]
["87%",4.0259375999999998,"4.026V",56.363126399999999,"56.36V"]
["86%",4.0145327999999996,"4.015V",56.203459199999998,"56.2V"]
["85%",4.0031280000000002,"4.003V",56.043792000000003,"56.04V"]
["84%",3.9919320000000003,"3.992V",55.887048000000007,"55.89V"]
["83%",3.9810840000000001,"3.981V",55.735176000000003,"55.74V"]
["82%",3.9702359999999999,"3.97V",55.583303999999998,"55.58V"]
{"$rows_left_out":82}